{"text_format":"1","workbook":"xlsx","n_sheets":6,"sheets":["Instructions","Competitions","Teams","Singles","Template","Work1"],"not_rendered":{"charts":0,"images":2,"macros":1,"external_links":0,"defined_names":21,"comments":0,"pivot_tables":0},"unopened":[],"bounds":{"document_bytes":16777216,"sheet_cells":100000,"rows_first":2000,"rows_last":500,"rows_between":2000,"halvings":0,"cell_chars":16384,"cell_head_chars":4096},"cells_cut":0,"cells_raw":0,"read":"whole","date_system":"1900"}

{"sheet":"Instructions","index":0,"n_rows":35,"n_cols":2,"rows_kept":35,"cut":false,"hidden":false,"merged":[]}
["Instructions"]
["(it will help to print these instructions so you can work on the sheets)"]
[null,"PREPARATION"]
[{"$f":"A3+1","v":1},"Copy this master file to a folder, rename the file and use the copy. Don't use the original."]
[{"$f":"A4+1","v":2},"Select the \"Competitions\" sheet."]
[{"$f":"A5+1","v":3},"Cell C4 is a special feature requested by one particular Comp Secretary. Putting a \"Y\" in here will add an asterisk to each challenger's name in the score sheets and a note at the bottom \"* challenger must organise - see rules\". It seems some people assume the games will be arranged by magic without them making contact with the opposition. There is a downside to this as adding the asterisks create a permanent entry so if you subsequently change a score the winner's name won't automatically be changed - you will have to enter it manually. After selecting this feature you won't be able to remove it later on in the competitions. If you don't need it don't use it."]
[4,"Create one line for each competition. Click the button on the right to extend the table, each click produces another line to fill in. The other button is used to create or modify the score sheets when all competition and team data has been entered."]
[5,"Sheet name is a name that you give to the tab on the bottom of the screen for the score Sheet which will be created for that competition. Use a short abbreviation so as to keep the tabs small."]
[6,"Competition name will appear on the top of the printouts."]
[7,"Format: 1=Singles, 2=Pairs, 3=Triples, 4=Fours"]
[8,"In \"Auto Round Draw\" enter 0 or 1.  After the draw is made this will automatically revert to 0 to avoid changing the draw again. Put a 1 in here to make an automatic random draw for the first round of matches when the score sheet is created or modified."]
[9,"In \"Team Players Draw\" enter 0 or 1. This  automatically reverts to 0 after the draw is made. This is for \"Drawn\" competitions. In the \"Teams\" sheet enter all the leads in the \"Player 1\" column, twos in \"Player 2\" column, etc. This setting will randomly mix all Player2's, Player 3's, and Player 4's to create teams before any auto round draw is made. Player 1's stay in the original position in the list. (You could reverse the order and put the skips in as Player 1's  - note that Player 1 is the first name in the printed score sheet)"]
[{"$f":"A12+1","v":10},"In \"Fixed Dates\" enter 0 or 1. 1 means the dates for all rounds are shown on the score sheet as fixed \"Play on\" dates. 0 means round dates before the Final are \"Play by\" dates. The Final date is always shown as \"Play on\". If this is not how your competitions work, you can always alter the words manually later after you have created the score sheets."]
[{"$f":"A13+1","v":11},"Enter all relevant round dates. If you like you can initially create a score sheet to check how many rounds there are before entering the dates, although you'll first need to enter all the teams and the draw first (see below). You can leave any or all dates blank."]
[12,"The \"Number of rounds\" column is calculated later and shown here for your information. It will help you decide how many dates to specify. You could enter the dates after creating the score sheets and then update the sheets with the button \"Click to create/modify score sheets\"."]
[13,"When all competitions have been specified, select the \"Teams\" tab and enter all the competitors names. This is the most time consuming part and the most subject to error so needs careful checking."]
[14,"Where teams have been entered without informing you of all competitors names, just leave some names blank and the relevant score sheet will show \"A.N. Other\" as the missing name(s). You always need at least a \"Player 1\" name."]
[15,"Leave \"Draw Number\" blank until all names have been entered."]
[16,"When all competitors have been entered you can fill in the draw numbers manually or prepare for an \"Auto Draw\" by just entering 1 in the relevant line on the \"Competitions\" sheet as mentioned above."]
[17,"For a manual draw you must fill in draw numbers. For example if there are 13 teams, put numbers 1 to 13 in a hat and as each number is drawn, fill in the \"Draw Number\" column. The team which draws number 1 will appear at the top of the draw and will play number 2, and so on. Of course it is much easier to do an Auto Draw using the computer, but some people like to be seen to do a draw to avoid accusations of \"fiddling\". This workbook does not do seeded draws automatically. For this you would do a manual draw."]
[18,"No score sheet will be produced unless all the Draw numbers are specified or an Auto Draw is selected."]
[19,"After all competitors have been entered go back to the Competitions sheet and click the top button to create all the score sheets. You don't need to do all of them at once. Sheets will only be created or updated for those competitions where all the draw numbers have been entered. If you make a mistake anywhere just correct the data and click the button again."]
[20,"You can keep changing all the details as long as no actual scores have been entered. Once any score is entered in the sheets, clicking the button will have no effect on that sheet."]
[21,"After setting up the score sheet print off the team list for your records and print the score sheet for display on the noticeboard. You will need to \"cut and paste\" the paper printouts when a competition can't be printed on one sheet. The printout size is intended to be big enough (when printed on A4 sheets landscape) for people to see on a noticeboard. You can adjust the page breaks by viewing the sheets in \"Page Break Preview\" - see ribbon \"View\" tab. When adjusting a break, always move the breaks up not down."]
[22,"When you have finished a session, close the workbook. At this point a set of PDF files will be produced in a subfolder called \"CompsPDF\" containing all the score sheets as \"Portable Document Files\". I use these for putting on our website. Next time you use the workbook and modify a score sheet, either before the competition begins or by entering any scores, an updated PDF file will be produced again when you close the workbook."]
[null,"RUNNING THE COMPETITIONS"]
[{"$f":"A26+1","v":1},"When the competition is underway, enter scores in the relevant boxes and you will see the winner advanced to the next round. Once scores start being entered, altering any setup data in the Competitions sheet or the Teams sheet will have no effect on the score sheet for that competition (see below for changes during the competition)."]
[{"$f":"A27+1","v":2},"I have deliberately not protected the cells in the score sheets which contain the team names. This is so you can alter the team names half way through the competition simply by entering them manually which will overwrite the formula, but take care not to alter any other formula on the sheet. To guard against errors always keep backup copies."]
[{"$f":"A28+1","v":3},"To enter names so that they appear on top of each other, hold the \"Alt\" key down and press \"Enter\" between names."]
[null,"Version date: 18-03-2020"]
[null,"You are free to use and share this  - see licence below for terms."]
[null,"This work is licensed under the Creative Commons Attribution-ShareAlike 4.0 International Public License. To view a copy of this license, visit  https://creativecommons.org/licenses/by-sa/4.0/"]
[null,"Make sure it is appropriate for your situation before using."]
[null,"Created with Excel 2010. Appears to work in Excel 2019."]
[null,"This is not supported but you may email me at bowlsit@gmail.com with comments or queries but I can't gurantee a response."]

{"sheet":"Competitions","index":1,"n_rows":11,"n_cols":17,"rows_kept":11,"cut":false,"hidden":false,"merged":[[5,9,5,15],[5,16,6,16]]}
[null,null,null,null,"Competitions"]
[null,null,"\"challenger\"",null,"Format:  1=Singles, 2=Pairs, 3=Triples, 4=Fours"]
[null,null,"asterisk required? (Y/N)",null,"Auto Round Draw: 0=Manual, 1=Auto (will reset to 0 after draw)"]
[null,null,"y",null,"Team Players Draw (creates drawn teams): 0=Manual, 1=Auto (will reset to 0 after draw)"]
[null,null,null,null,"Fixed Dates: 0=Play by (only Final is fixed date), 1=Play on (each round fixed date)"]
[null,null,null,null,null,null,null,null,null,"Dates",null,null,null,null,null,null,"Number of Rounds (calc)"]
["Total Score","Previous Total","Comp No","Sheet Name","Competition","Format","Auto Round Draw","Team Players Draw","Fixed Dates","Round of 128","Round of 64","Round of 32","Round of 16","Quarter-Final","Semi-Final","Final"]
[]
[{"$f":"SUM(INDIRECT(\"'\"&D9&\"'!B5:N133\"))","v":0},0,{"$f":"C8+1","v":1},"Singles","Ladies Singles",1,0,0,0,null,null,"2019-11-03","2019-11-17","2019-12-01","2019-12-15","2019-12-21",5]
[{"$f":"SUM(INDIRECT(\"'\"&D10&\"'!B5:N133\"))","v":{"$error":"#REF!"}},0,{"$f":"C9+1","v":2},"MnsPrs","MENS PAIRS",2,0,0,0,null,null,"2019-11-03","2019-11-17","2019-12-01","2019-12-15","2019-12-21"]
[{"$error":"#REF!"},0,{"$f":"C10+1","v":3},"MS2WTrip","MENS SENIOR 2 WOOD TRIPLES",3,0,0,0,null,null,"2019-11-03","2019-11-17","2019-12-01","2019-12-15","2019-12-21"]

{"sheet":"Teams","index":2,"n_rows":131,"n_cols":20,"rows_kept":131,"cut":false,"hidden":false,"merged":[[0,1,0,5],[0,8,0,12],[0,15,0,19]]}
[1,{"$f":"VLOOKUP(A1,CompsList,3,FALSE)","v":"Ladies Singles"},null,null,null,null,null,2,{"$f":"VLOOKUP(H1,CompsList,3,FALSE)","v":"MENS PAIRS"},null,null,null,null,null,3,{"$f":"VLOOKUP(O1,CompsList,3,FALSE)","v":"MENS SENIOR 2 WOOD TRIPLES"}]
["Team","Draw",null,null,null,null,null,"Team","Draw",null,null,null,null,null,"Team","Draw"]
["Number","Number","Player 1","Player 2","Player 3","Player 4",null,"Number","Number","Player 1","Player 2","Player 3","Player 4",null,"Number","Number","Player 1","Player 2","Player 3","Player 4"]
[1,4,"Isla Lee",null,null,null,null,1,null,null,null,null,null,null,1]
[2,9,"Charlotte Smith",null,null,null,null,2,null,null,null,null,null,null,2]
[3,6,"Cora Jones",null,null,null,null,3,null,null,null,null,null,null,3]
[4,11,"Penelope Taylor",null,null,null,null,4,null,null,null,null,null,null,4]
[5,23,"Violet Williams",null,null,null,null,5,null,null,null,null,null,null,5]
[6,5,"Hazel Brown",null,null,null,null,6,null,null,null,null,null,null,6]
[7,3,"Eleanor Davies",null,null,null,null,7,null,null,null,null,null,null,7]
[8,17,"Amelia Evans",null,null,null,null,8,null,null,null,null,null,null,8]
[9,7,"Adeline Wilson",null,null,null,null,9,null,null,null,null,null,null,9]
[10,20,"Claire Thomas",null,null,null,null,10,null,null,null,null,null,null,10]
[11,15,"Adelaide Roberts",null,null,null,null,11,null,null,null,null,null,null,11]
[12,19,"Lucy Johnson",null,null,null,null,12,null,null,null,null,null,null,12]
[13,2,"Genevieve Lewis",null,null,null,null,13,null,null,null,null,null,null,13]
[14,21,"Lila Walker",null,null,null,null,14,null,null,null,null,null,null,14]
[15,18,"Willa Robinson",null,null,"",null,15,null,null,null,null,null,null,15]
[16,8,"Ivy Wood",null,null,"",null,16,null,null,null,null,null,null,16]
[17,16,"Maisie Thompson",null,null,"",null,17,null,null,null,null,null,null,17]
[18,10,"Alice White",null,null,"",null,18,null,null,null,null,null,null,18]
[19,22,"Scarlett Watson",null,null,"",null,19,null,null,null,null,null,null,19]
[20,14,"Evangeline Jackson",null,null,"",null,20,null,null,null,null,null,null,20]
[21,1,"Ellie Wright",null,null,"",null,21,null,null,null,null,null,null,21]
[22,13,"Cordelia Green",null,null,"",null,22,null,null,null,null,null,null,22]
[23,12,"Olivia Harris",null,null,"",null,23,null,null,null,null,null,null,23]
[24,null,null,null,null,"",null,24,null,null,null,null,null,null,24]
[25,null,null,null,null,"",null,25,null,null,null,null,null,null,25]
[26,null,null,null,null,"",null,26,null,null,null,null,null,null,26]
[27,null,null,null,null,"",null,27,null,null,null,null,null,null,27]
[28,null,null,null,null,"",null,28,null,null,null,null,null,null,28]
[29,null,null,null,null,"",null,29,null,null,null,null,null,null,29]
[30,null,null,null,null,"",null,30,null,null,null,null,null,null,30]
[31,null,null,"","","",null,31,null,null,null,null,null,null,31]
[32,null,null,"","","",null,32,null,null,null,null,null,null,32]
[33,null,null,"","","",null,33,null,null,null,null,null,null,33]
[34,null,null,"","","",null,34,null,null,null,null,null,null,34]
[35,null,null,"","","",null,35,null,null,null,null,null,null,35]
[36,null,null,"","","",null,36,null,null,null,null,null,null,36]
[37,null,null,"","","",null,37,null,null,null,null,null,null,37]
[38,null,null,"","","",null,38,null,null,null,null,null,null,38]
[39,null,null,"","","",null,39,null,null,null,null,null,null,39]
[40,null,null,"","","",null,40,null,null,null,null,null,null,40]
[41,null,null,"","","",null,41,null,null,null,null,null,null,41]
[42,null,null,"","","",null,42,null,null,null,null,null,null,42]
[43,null,null,"","","",null,43,null,null,null,null,null,null,43]
[44,null,null,"","","",null,44,null,null,null,null,null,null,44]
[45,null,null,"","","",null,45,null,null,null,null,null,null,45]
[46,null,null,"","","",null,46,null,null,null,null,null,null,46]
[47,null,null,"","","",null,47,null,null,null,null,null,null,47]
[48,null,null,"","","",null,48,null,null,null,null,null,null,48]
[49,null,null,"","","",null,49,null,null,null,null,null,null,49]
[50,null,null,"","","",null,50,null,null,null,null,null,null,50]
[51,null,null,"","","",null,51,null,null,null,null,null,null,51]
[52,null,null,"","","",null,52,null,null,null,null,null,null,52]
[53,null,"","","","",null,53,null,null,null,null,null,null,53]
[54,null,"","","","",null,54,null,null,null,null,null,null,54]
[55,null,"","","","",null,55,null,null,null,null,null,null,55]
[56,null,"","","","",null,56,null,null,null,null,null,null,56]
[57,null,"","","","",null,57,null,null,null,null,null,null,57]
[58,null,"","","","",null,58,null,null,null,null,null,null,58]
[59,null,"","","","",null,59,null,null,null,null,null,null,59]
[60,null,"","","","",null,60,null,null,null,null,null,null,60]
[61,null,"","","","",null,61,null,null,null,null,null,null,61]
[62,null,"","","","",null,62,null,null,null,null,null,null,62]
[63,null,"","","","",null,63,null,null,null,null,null,null,63]
[64,null,"","","","",null,64,null,null,null,null,null,null,64]
[65,null,"","","","",null,65,null,null,null,null,null,null,65]
[66,null,"","","","",null,66,null,null,null,null,null,null,66]
[67,null,"","","","",null,67,null,null,null,null,null,null,67]
[68,null,"","","","",null,68,null,null,null,null,null,null,68]
[69,null,"","","","",null,69,null,null,null,null,null,null,69]
[70,null,"","","","",null,70,null,null,null,null,null,null,70]
[71,null,"","","","",null,71,null,null,null,null,null,null,71]
[72,null,"","","","",null,72,null,null,null,null,null,null,72]
[73,null,"","","","",null,73,null,null,null,null,null,null,73]
[74,null,"","","","",null,74,null,null,null,null,null,null,74]
[75,null,"","","","",null,75,null,null,null,null,null,null,75]
[76,null,"","","","",null,76,null,null,null,null,null,null,76]
[77,null,"","","","",null,77,null,null,null,null,null,null,77]
[78,null,"","","","",null,78,null,null,null,null,null,null,78]
[79,null,"","","","",null,79,null,null,null,null,null,null,79]
[80,null,"","","","",null,80,null,null,null,null,null,null,80]
[81,null,"","","","",null,81,null,null,null,null,null,null,81]
[82,null,"","","","",null,82,null,null,null,null,null,null,82]
[83,null,"","","","",null,83,null,null,null,null,null,null,83]
[84,null,"","","","",null,84,null,null,null,null,null,null,84]
[85,null,"","","","",null,85,null,null,null,null,null,null,85]
[86,null,"","","","",null,86,null,null,null,null,null,null,86]
[87,null,"","","","",null,87,null,null,null,null,null,null,87]
[88,null,"","","","",null,88,null,null,null,null,null,null,88]
[89,null,"","","","",null,89,null,null,null,null,null,null,89]
[90,null,"","","","",null,90,null,null,null,null,null,null,90]
[91,null,"","","","",null,91,null,null,null,null,null,null,91]
[92,null,"","","","",null,92,null,null,null,null,null,null,92]
[93,null,"","","","",null,93,null,null,null,null,null,null,93]
[94,null,"","","","",null,94,null,null,null,null,null,null,94]
[95,null,"","","","",null,95,null,null,null,null,null,null,95]
[96,null,"","","","",null,96,null,null,null,null,null,null,96]
[97,null,"","","","",null,97,null,null,null,null,null,null,97]
[98,null,"","","","",null,98,null,null,null,null,null,null,98]
[99,null,"","","","",null,99,null,null,null,null,null,null,99]
[100,null,"","","","",null,100,null,null,null,null,null,null,100]
[101,null,"","","","",null,101,null,null,null,null,null,null,101]
[102,null,"","","","",null,102,null,null,null,null,null,null,102]
[103,null,"","","","",null,103,null,null,null,null,null,null,103]
[104,null,"","","","",null,104,null,null,null,null,null,null,104]
[105,null,"","","","",null,105,null,null,null,null,null,null,105]
[106,null,"","","","",null,106,null,null,null,null,null,null,106]
[107,null,"","","","",null,107,null,null,null,null,null,null,107]
[108,null,"","","","",null,108,null,null,null,null,null,null,108]
[109,null,"","","","",null,109,null,null,null,null,null,null,109]
[110,null,"","","","",null,110,null,null,null,null,null,null,110]
[111,null,"","","","",null,111,null,null,null,null,null,null,111]
[112,null,"","","","",null,112,null,null,null,null,null,null,112]
[113,null,"","","","",null,113,null,null,null,null,null,null,113]
[114,null,"","","","",null,114,null,null,null,null,null,null,114]
[115,null,"","","","",null,115,null,null,null,null,null,null,115]
[116,null,"","","","",null,116,null,null,null,null,null,null,116]
[117,null,"","","","",null,117,null,null,null,null,null,null,117]
[118,null,"","","","",null,118,null,null,null,null,null,null,118]
[119,null,"","","","",null,119,null,null,null,null,null,null,119]
[120,null,"","","","",null,120,null,null,null,null,null,null,120]
[121,null,"","","","",null,121,null,null,null,null,null,null,121]
[122,null,"","","","",null,122,null,null,null,null,null,null,122]
[123,null,"","","","",null,123,null,null,null,null,null,null,123]
[124,null,"","","","",null,124,null,null,null,null,null,null,124]
[125,null,"","","","",null,125,null,null,null,null,null,null,125]
[126,null,"","","","",null,126,null,null,null,null,null,null,126]
[127,null,"","","","",null,127,null,null,null,null,null,null,127]
[128,null,"","","","",null,128,null,null,null,null,null,null,128]

{"sheet":"Singles","index":3,"n_rows":35,"n_cols":9,"rows_kept":35,"cut":false,"hidden":false,"merged":[[28,6,35,6],[28,7,35,7],[30,2,31,2],[30,3,31,3],[32,2,33,2],[32,3,33,3],[32,4,35,4],[32,5,35,5],[34,2,35,2],[34,3,35,3],[26,2,27,2],[26,3,27,3],[28,2,29,2],[28,3,29,3],[28,4,31,4],[28,5,31,5],[20,6,27,6],[20,7,27,7],[20,8,35,8],[20,9,35,9],[22,2,23,2],[22,3,23,3],[24,2,25,2],[24,3,25,3],[24,4,27,4],[24,5,27,5],[16,5,19,5],[18,2,19,2],[18,3,19,3],[20,2,21,2],[20,3,21,3],[20,4,23,4],[20,5,23,5],[12,3,13,3],[12,4,15,4],[12,5,15,5],[12,6,19,6],[12,7,19,7],[14,2,15,2],[14,3,15,3],[16,2,17,2],[16,3,17,3],[16,4,19,4],[6,2,7,2],[6,3,7,3],[8,2,9,2],[8,3,9,3],[8,4,11,4],[8,5,11,5],[10,2,11,2],[10,3,11,3],[12,2,13,2],[4,8,19,8],[4,9,19,9],[4,2,5,2],[4,3,5,3],[4,4,7,4],[4,5,7,5],[4,6,11,6],[4,7,11,7]]}
[null,"Ladies Singles"]
[]
["ROUND OF 32",null,"ROUND OF 16",null,"QUARTER FINAL",null,"SEMI FINAL",null,"FINAL"]
["Play by 03/11/2019",null,"Play by 17/11/2019",null,"Play by 01/12/2019",null,"Play by 15/12/2019",null,"Play on 21/12/2019"]
["Ellie Wright",null,{"$f":"IF(B5+B6>0,IF(B5>B6,A5,A6),\"\")","v":""},null,{"$f":"IF(D5+D7>0,IF(D5>D7,C5,C7),\"\")","v":""},null,{"$f":"IF(F5+F9>0,IF(F5>F9,E5,E9),\"\")","v":""},null,{"$f":"IF(H5+H13>0,IF(H5>H13,G5,G13),\"\")","v":""}]
["Genevieve Lewis"]
["Eleanor Davies",null,{"$f":"IF(B7+B8>0,IF(B7>B8,A7,A8),\"\")","v":""}]
["Isla Lee"]
["Hazel Brown",null,{"$f":"IF(B9+B10>0,IF(B9>B10,A9,A10),\"\")","v":""},null,{"$f":"IF(D9+D11>0,IF(D9>D11,C9,C11),\"\")","v":""}]
["Cora Jones"]
["Adeline Wilson",null,{"$f":"IF(B11+B12>0,IF(B11>B12,A11,A12),\"\")","v":""}]
["Ivy Wood"]
["Charlotte Smith",null,{"$f":"IF(B13+B14>0,IF(B13>B14,A13,A14),\"\")","v":""},null,{"$f":"IF(D13+D15>0,IF(D13>D15,C13,C15),\"\")","v":""},null,{"$f":"IF(F13+F17>0,IF(F13>F17,E13,E17),\"\")","v":""}]
["Alice White"]
["Penelope Taylor",null,{"$f":"IF(B15+B16>0,IF(B15>B16,A15,A16),\"\")","v":""}]
["Olivia Harris"]
["Cordelia Green",null,{"$f":"IF(B17+B18>0,IF(B17>B18,A17,A18),\"\")","v":""},null,{"$f":"IF(D17+D19>0,IF(D17>D19,C17,C19),\"\")","v":""}]
["Evangeline Jackson"]
[null,null,"Adelaide Roberts"]
[]
[null,null,"Maisie Thompson",null,{"$f":"IF(D21+D23>0,IF(D21>D23,C21,C23),\"\")","v":""},null,{"$f":"IF(F21+F25>0,IF(F21>F25,E21,E25),\"\")","v":""},null,{"$f":"IF(H21+H29>0,IF(H21>H29,G21,G29),\"\")","v":""}]
[]
[null,null,"Amelia Evans"]
[]
[null,null,"Willa Robinson",null,{"$f":"IF(D25+D27>0,IF(D25>D27,C25,C27),\"\")","v":""}]
[]
[null,null,"Lucy Johnson"]
[]
[null,null,"Claire Thomas",null,{"$f":"IF(D29+D31>0,IF(D29>D31,C29,C31),\"\")","v":""},null,{"$f":"IF(F29+F33>0,IF(F29>F33,E29,E33),\"\")","v":""}]
[]
[null,null,"Lila Walker"]
[]
[null,null,"Scarlett Watson",null,{"$f":"IF(D33+D35>0,IF(D33>D35,C33,C35),\"\")","v":""}]
[]
[null,null,"Violet Williams"]

{"sheet":"Template","index":4,"n_rows":131,"n_cols":15,"rows_kept":131,"cut":false,"hidden":true,"merged":[[4,2,5,2],[8,2,9,2],[6,2,7,2],[22,2,23,2],[10,2,11,2],[24,2,25,2],[26,2,27,2],[28,2,29,2],[30,2,31,2],[12,2,13,2],[14,2,15,2],[16,2,17,2],[18,2,19,2],[20,2,21,2],[104,2,105,2],[106,2,107,2],[108,2,109,2],[110,2,111,2],[62,2,63,2],[64,2,65,2],[66,2,67,2],[68,2,69,2],[70,2,71,2],[82,2,83,2],[100,2,101,2],[102,2,103,2],[84,2,85,2],[86,2,87,2],[88,2,89,2],[90,2,91,2],[72,2,73,2],[74,2,75,2],[76,2,77,2],[78,2,79,2],[80,2,81,2],[130,2,131,2],[112,2,113,2],[114,2,115,2],[116,2,117,2],[118,2,119,2],[120,2,121,2],[122,2,123,2],[124,2,125,2],[126,2,127,2],[128,2,129,2],[4,4,7,4],[8,4,11,4],[12,4,15,4],[16,4,19,4],[20,4,23,4],[92,2,93,2],[94,2,95,2],[96,2,97,2],[98,2,99,2],[52,2,53,2],[54,2,55,2],[56,2,57,2],[58,2,59,2],[60,2,61,2],[42,2,43,2],[44,2,45,2],[46,2,47,2],[48,2,49,2],[50,2,51,2],[32,2,33,2],[34,2,35,2],[36,2,37,2],[38,2,39,2],[40,2,41,2],[72,5,75,5],[44,4,47,4],[48,4,51,4],[52,4,55,4],[56,4,59,4],[60,4,63,4],[60,5,63,5],[64,5,67,5],[24,4,27,4],[28,4,31,4],[32,4,35,4],[36,4,39,4],[40,4,43,4],[52,5,55,5],[56,5,59,5],[60,6,67,6],[68,6,75,6],[76,6,83,6],[84,6,91,6],[92,6,99,6],[100,6,107,6],[108,6,115,6],[104,4,107,4],[108,4,111,4],[112,4,115,4],[100,5,103,5],[104,5,107,5],[108,5,111,5],[84,4,87,4],[88,4,91,4],[92,4,95,4],[96,4,99,4],[100,4,103,4],[64,4,67,4],[68,4,71,4],[72,4,75,4],[76,4,79,4],[80,4,83,4],[68,5,71,5],[40,3,41,3],[42,3,43,3],[4,14,131,14],[4,10,35,10],[36,10,67,10],[68,10,99,10],[100,10,131,10],[4,12,67,12],[68,12,131,12],[4,13,67,13],[68,13,131,13],[4,11,35,11],[36,11,67,11],[68,11,99,11],[100,11,131,11],[124,4,127,4],[128,4,131,4],[4,6,11,6],[12,6,19,6],[20,6,27,6],[28,6,35,6],[36,6,43,6],[44,6,51,6],[52,6,59,6],[22,3,23,3],[24,3,25,3],[26,3,27,3],[28,3,29,3],[30,3,31,3],[32,3,33,3],[34,3,35,3],[36,3,37,3],[38,3,39,3],[4,3,5,3],[6,3,7,3],[8,3,9,3],[10,3,11,3],[12,3,13,3],[14,3,15,3],[16,3,17,3],[18,3,19,3],[20,3,21,3],[44,3,45,3],[46,3,47,3],[48,3,49,3],[50,3,51,3],[52,3,53,3],[54,3,55,3],[56,3,57,3],[58,3,59,3],[60,3,61,3],[62,3,63,3],[64,3,65,3],[66,3,67,3],[68,3,69,3],[70,3,71,3],[72,3,73,3],[74,3,75,3],[76,3,77,3],[78,3,79,3],[130,3,131,3],[98,3,99,3],[100,3,101,3],[102,3,103,3],[104,3,105,3],[106,3,107,3],[108,3,109,3],[110,3,111,3],[112,3,113,3],[114,3,115,3],[116,3,117,3],[118,3,119,3],[120,3,121,3],[122,3,123,3],[124,3,125,3],[126,3,127,3],[128,3,129,3],[116,4,119,4],[120,4,123,4],[80,5,83,5],[84,5,87,5],[88,5,91,5],[92,5,95,5],[96,5,99,5],[120,5,123,5],[80,3,81,3],[82,3,83,3],[84,3,85,3],[86,3,87,3],[88,3,89,3],[90,3,91,3],[112,5,115,5],[116,5,119,5],[92,3,93,3],[94,3,95,3],[96,3,97,3],[4,5,7,5],[8,5,11,5],[12,5,15,5],[16,5,19,5],[20,5,23,5],[24,5,27,5],[28,5,31,5],[32,5,35,5],[36,5,39,5],[124,5,127,5],[128,5,131,5],[116,6,123,6],[124,6,131,6],[4,7,11,7],[12,7,19,7],[20,7,27,7],[28,7,35,7],[36,7,43,7],[44,7,51,7],[52,7,59,7],[60,7,67,7],[68,7,75,7],[76,7,83,7],[84,7,91,7],[92,7,99,7],[100,7,107,7],[108,7,115,7],[116,7,123,7],[124,7,131,7],[76,5,79,5],[40,5,43,5],[44,5,47,5],[48,5,51,5],[4,8,19,8],[20,8,35,8],[36,8,51,8],[52,8,67,8],[68,8,83,8],[84,8,99,8],[100,8,115,8],[116,8,131,8],[4,9,19,9],[20,9,35,9],[36,9,51,9],[52,9,67,9],[68,9,83,9],[84,9,99,9],[100,9,115,9],[116,9,131,9]]}
[]
[]
["ROUND OF 128",null,"ROUND OF 64",null,"ROUND OF 32",null,"ROUND OF 16",null,"QUARTER FINAL",null,"SEMI FINAL",null,"FINAL",null,"WINNER"]
[]
[null,null,{"$f":"IF(B5+B6>0,IF(B5>B6,A5,A6),\"\")","v":""},null,{"$f":"IF(D5+D7>0,IF(D5>D7,C5,C7),\"\")","v":""},null,{"$f":"IF(F5+F9>0,IF(F5>F9,E5,E9),\"\")","v":""},null,{"$f":"IF(H5+H13>0,IF(H5>H13,G5,G13),\"\")","v":""},null,{"$f":"IF(J5+J21>0,IF(J5>J21,I5,I21),\"\")","v":""},null,{"$f":"IF(L5+L37>0,IF(L5>L37,K5,K37),\"\")","v":""},null,{"$f":"IF(N5+N69>0,IF(N5>N62,M5,M62),\"\")","v":""}]
[]
[null,null,{"$f":"IF(B7+B8>0,IF(B7>B8,A7,A8),\"\")","v":""}]
[]
[null,null,{"$f":"IF(B9+B10>0,IF(B9>B10,A9,A10),\"\")","v":""},null,{"$f":"IF(D9+D11>0,IF(D9>D11,C9,C11),\"\")","v":""}]
[]
[null,null,{"$f":"IF(B11+B12>0,IF(B11>B12,A11,A12),\"\")","v":""}]
[]
[null,null,{"$f":"IF(B13+B14>0,IF(B13>B14,A13,A14),\"\")","v":""},null,{"$f":"IF(D13+D15>0,IF(D13>D15,C13,C15),\"\")","v":""},null,{"$f":"IF(F13+F17>0,IF(F13>F17,E13,E17),\"\")","v":""}]
[]
[null,null,{"$f":"IF(B15+B16>0,IF(B15>B16,A15,A16),\"\")","v":""}]
[]
[null,null,{"$f":"IF(B17+B18>0,IF(B17>B18,A17,A18),\"\")","v":""},null,{"$f":"IF(D17+D19>0,IF(D17>D19,C17,C19),\"\")","v":""}]
[]
[null,null,{"$f":"IF(B19+B20>0,IF(B19>B20,A19,A20),\"\")","v":""}]
[]
[null,null,{"$f":"IF(B21+B22>0,IF(B21>B22,A21,A22),\"\")","v":""},null,{"$f":"IF(D21+D23>0,IF(D21>D23,C21,C23),\"\")","v":""},null,{"$f":"IF(F21+F25>0,IF(F21>F25,E21,E25),\"\")","v":""},null,{"$f":"IF(H21+H29>0,IF(H21>H29,G21,G29),\"\")","v":""}]
[]
[null,null,{"$f":"IF(B23+B24>0,IF(B23>B24,A23,A24),\"\")","v":""}]
[]
[null,null,{"$f":"IF(B25+B26>0,IF(B25>B26,A25,A26),\"\")","v":""},null,{"$f":"IF(D25+D27>0,IF(D25>D27,C25,C27),\"\")","v":""}]
[]
[null,null,{"$f":"IF(B27+B28>0,IF(B27>B28,A27,A28),\"\")","v":""}]
[]
[null,null,{"$f":"IF(B29+B30>0,IF(B29>B30,A29,A30),\"\")","v":""},null,{"$f":"IF(D29+D31>0,IF(D29>D31,C29,C31),\"\")","v":""},null,{"$f":"IF(F29+F33>0,IF(F29>F33,E29,E33),\"\")","v":""}]
[]
[null,null,{"$f":"IF(B31+B32>0,IF(B31>B32,A31,A32),\"\")","v":""}]
[]
[null,null,{"$f":"IF(B33+B34>0,IF(B33>B34,A33,A34),\"\")","v":""},null,{"$f":"IF(D33+D35>0,IF(D33>D35,C33,C35),\"\")","v":""}]
[]
[null,null,{"$f":"IF(B35+B36>0,IF(B35>B36,A35,A36),\"\")","v":""}]
[]
[null,null,{"$f":"IF(B37+B38>0,IF(B37>B38,A37,A38),\"\")","v":""},null,{"$f":"IF(D37+D39>0,IF(D37>D39,C37,C39),\"\")","v":""},null,{"$f":"IF(F37+F41>0,IF(F37>F41,E37,E41),\"\")","v":""},null,{"$f":"IF(H37+H45>0,IF(H37>H45,G37,G45),\"\")","v":""},null,{"$f":"IF(J37+J53>0,IF(J37>J53,I37,I53),\"\")","v":""}]
[]
[null,null,{"$f":"IF(B39+B40>0,IF(B39>B40,A39,A40),\"\")","v":""}]
[]
[null,null,{"$f":"IF(B41+B42>0,IF(B41>B42,A41,A42),\"\")","v":""},null,{"$f":"IF(D41+D43>0,IF(D41>D43,C41,C43),\"\")","v":""}]
[]
[null,null,{"$f":"IF(B43+B44>0,IF(B43>B44,A43,A44),\"\")","v":""}]
[]
[null,null,{"$f":"IF(B45+B46>0,IF(B45>B46,A45,A46),\"\")","v":""},null,{"$f":"IF(D45+D47>0,IF(D45>D47,C45,C47),\"\")","v":""},null,{"$f":"IF(F45+F49>0,IF(F45>F49,E45,E49),\"\")","v":""}]
[]
[null,null,{"$f":"IF(B47+B48>0,IF(B47>B48,A47,A48),\"\")","v":""}]
[]
[null,null,{"$f":"IF(B49+B50>0,IF(B49>B50,A49,A50),\"\")","v":""},null,{"$f":"IF(D49+D51>0,IF(D49>D51,C49,C51),\"\")","v":""}]
[]
[null,null,{"$f":"IF(B51+B52>0,IF(B51>B52,A51,A52),\"\")","v":""}]
[]
[null,null,{"$f":"IF(B53+B54>0,IF(B53>B54,A53,A54),\"\")","v":""},null,{"$f":"IF(D53+D55>0,IF(D53>D55,C53,C55),\"\")","v":""},null,{"$f":"IF(F53+F57>0,IF(F53>F57,E53,E57),\"\")","v":""},null,{"$f":"IF(H53+H61>0,IF(H53>H61,G53,G61),\"\")","v":""}]
[]
[null,null,{"$f":"IF(B55+B56>0,IF(B55>B56,A55,A56),\"\")","v":""}]
[]
[null,null,{"$f":"IF(B57+B58>0,IF(B57>B58,A57,A58),\"\")","v":""},null,{"$f":"IF(D57+D59>0,IF(D57>D59,C57,C59),\"\")","v":""}]
[]
[null,null,{"$f":"IF(B59+B60>0,IF(B59>B60,A59,A60),\"\")","v":""}]
[]
[null,null,{"$f":"IF(B61+B62>0,IF(B61>B62,A61,A62),\"\")","v":""},null,{"$f":"IF(D61+D63>0,IF(D61>D63,C61,C63),\"\")","v":""},null,{"$f":"IF(F61+F65>0,IF(F61>F65,E61,E65),\"\")","v":""}]
[]
[null,null,{"$f":"IF(B63+B64>0,IF(B63>B64,A63,A64),\"\")","v":""}]
[]
[null,null,{"$f":"IF(B65+B66>0,IF(B65>B66,A65,A66),\"\")","v":""},null,{"$f":"IF(D65+D67>0,IF(D65>D67,C65,C67),\"\")","v":""}]
[]
[null,null,{"$f":"IF(B67+B68>0,IF(B67>B68,A67,A68),\"\")","v":""}]
[]
[null,null,{"$f":"IF(B69+B70>0,IF(B69>B70,A69,A70),\"\")","v":""},null,{"$f":"IF(D69+D71>0,IF(D69>D71,C69,C71),\"\")","v":""},null,{"$f":"IF(F69+F73>0,IF(F69>F73,E69,E73),\"\")","v":""},null,{"$f":"IF(H69+H77>0,IF(H69>H77,G69,G77),\"\")","v":""},null,{"$f":"IF(J69+J85>0,IF(J69>J85,I69,I85),\"\")","v":""},null,{"$f":"IF(L69+L101>0,IF(L69>L101,K69,K101),\"\")","v":""}]
[]
[null,null,{"$f":"IF(B71+B72>0,IF(B71>B72,A71,A72),\"\")","v":""}]
[]
[null,null,{"$f":"IF(B73+B74>0,IF(B73>B74,A73,A74),\"\")","v":""},null,{"$f":"IF(D73+D75>0,IF(D73>D75,C73,C75),\"\")","v":""}]
[]
[null,null,{"$f":"IF(B75+B76>0,IF(B75>B76,A75,A76),\"\")","v":""}]
[]
[null,null,{"$f":"IF(B77+B78>0,IF(B77>B78,A77,A78),\"\")","v":""},null,{"$f":"IF(D77+D79>0,IF(D77>D79,C77,C79),\"\")","v":""},null,{"$f":"IF(F77+F81>0,IF(F77>F81,E77,E81),\"\")","v":""}]
[]
[null,null,{"$f":"IF(B79+B80>0,IF(B79>B80,A79,A80),\"\")","v":""}]
[]
[null,null,{"$f":"IF(B81+B82>0,IF(B81>B82,A81,A82),\"\")","v":""},null,{"$f":"IF(D81+D83>0,IF(D81>D83,C81,C83),\"\")","v":""}]
[]
[null,null,{"$f":"IF(B83+B84>0,IF(B83>B84,A83,A84),\"\")","v":""}]
[]
[null,null,{"$f":"IF(B85+B86>0,IF(B85>B86,A85,A86),\"\")","v":""},null,{"$f":"IF(D85+D87>0,IF(D85>D87,C85,C87),\"\")","v":""},null,{"$f":"IF(F85+F89>0,IF(F85>F89,E85,E89),\"\")","v":""},null,{"$f":"IF(H85+H93>0,IF(H85>H93,G85,G93),\"\")","v":""}]
[]
[null,null,{"$f":"IF(B87+B88>0,IF(B87>B88,A87,A88),\"\")","v":""}]
[]
[null,null,{"$f":"IF(B89+B90>0,IF(B89>B90,A89,A90),\"\")","v":""},null,{"$f":"IF(D89+D91>0,IF(D89>D91,C89,C91),\"\")","v":""}]
[]
[null,null,{"$f":"IF(B91+B92>0,IF(B91>B92,A91,A92),\"\")","v":""}]
[]
[null,null,{"$f":"IF(B93+B94>0,IF(B93>B94,A93,A94),\"\")","v":""},null,{"$f":"IF(D93+D95>0,IF(D93>D95,C93,C95),\"\")","v":""},null,{"$f":"IF(F93+F97>0,IF(F93>F97,E93,E97),\"\")","v":""}]
[]
[null,null,{"$f":"IF(B95+B96>0,IF(B95>B96,A95,A96),\"\")","v":""}]
[]
[null,null,{"$f":"IF(B97+B98>0,IF(B97>B98,A97,A98),\"\")","v":""},null,{"$f":"IF(D97+D99>0,IF(D97>D99,C97,C99),\"\")","v":""}]
[]
[null,null,{"$f":"IF(B99+B100>0,IF(B99>B100,A99,A100),\"\")","v":""}]
[]
[null,null,{"$f":"IF(B101+B102>0,IF(B101>B102,A101,A102),\"\")","v":""},null,{"$f":"IF(D101+D103>0,IF(D101>D103,C101,C103),\"\")","v":""},null,{"$f":"IF(F101+F105>0,IF(F101>F105,E101,E105),\"\")","v":""},null,{"$f":"IF(H101+H109>0,IF(H101>H109,G101,G109),\"\")","v":""},null,{"$f":"IF(J101+J117>0,IF(J101>J117,I101,I117),\"\")","v":""}]
[]
[null,null,{"$f":"IF(B103+B104>0,IF(B103>B104,A103,A104),\"\")","v":""}]
[]
[null,null,{"$f":"IF(B105+B106>0,IF(B105>B106,A105,A106),\"\")","v":""},null,{"$f":"IF(D105+D107>0,IF(D105>D107,C105,C107),\"\")","v":""}]
[]
[null,null,{"$f":"IF(B107+B108>0,IF(B107>B108,A107,A108),\"\")","v":""}]
[]
[null,null,{"$f":"IF(B109+B110>0,IF(B109>B110,A109,A110),\"\")","v":""},null,{"$f":"IF(D109+D111>0,IF(D109>D111,C109,C111),\"\")","v":""},null,{"$f":"IF(F109+F113>0,IF(F109>F113,E109,E113),\"\")","v":""}]
[]
[null,null,{"$f":"IF(B111+B112>0,IF(B111>B112,A111,A112),\"\")","v":""}]
[]
[null,null,{"$f":"IF(B113+B114>0,IF(B113>B114,A113,A114),\"\")","v":""},null,{"$f":"IF(D113+D115>0,IF(D113>D115,C113,C115),\"\")","v":""}]
[]
[null,null,{"$f":"IF(B115+B116>0,IF(B115>B116,A115,A116),\"\")","v":""}]
[]
[null,null,{"$f":"IF(B117+B118>0,IF(B117>B118,A117,A118),\"\")","v":""},null,{"$f":"IF(D117+D119>0,IF(D117>D119,C117,C119),\"\")","v":""},null,{"$f":"IF(F117+F121>0,IF(F117>F121,E117,E121),\"\")","v":""},null,{"$f":"IF(H117+H125>0,IF(H117>H125,G117,G125),\"\")","v":""}]
[]
[null,null,{"$f":"IF(B119+B120>0,IF(B119>B120,A119,A120),\"\")","v":""}]
[]
[null,null,{"$f":"IF(B121+B122>0,IF(B121>B122,A121,A122),\"\")","v":""},null,{"$f":"IF(D121+D123>0,IF(D121>D123,C121,C123),\"\")","v":""}]
[]
[null,null,{"$f":"IF(B123+B124>0,IF(B123>B124,A123,A124),\"\")","v":""}]
[]
[null,null,{"$f":"IF(B125+B126>0,IF(B125>B126,A125,A126),\"\")","v":""},null,{"$f":"IF(D125+D127>0,IF(D125>D127,C125,C127),\"\")","v":""},null,{"$f":"IF(F125+F129>0,IF(F125>F129,E125,E129),\"\")","v":""}]
[]
[null,null,{"$f":"IF(B127+B128>0,IF(B127>B128,A127,A128),\"\")","v":""}]
[]
[null,null,{"$f":"IF(B129+B130>0,IF(B129>B130,A129,A130),\"\")","v":""},null,{"$f":"IF(D129+D131>0,IF(D129>D131,C129,C131),\"\")","v":""}]
[]
[null,null,{"$f":"IF(B131+B132>0,IF(B131>B132,A131,A132),\"\")","v":""}]

{"sheet":"Work1","index":5,"n_rows":133,"n_cols":14,"rows_kept":133,"cut":false,"hidden":true,"merged":[]}
[null,null,null,null,null,null,null,null,null,null,"Rounds",{"$f":"_xlfn.CEILING.PRECISE(LOG10(L3)/LOG10(2))","v":5},null,"ANOtext"]
[null,null,null,null,null,null,null,null,null,null,"Round of",{"$f":"2^_xlfn.CEILING.PRECISE(LOG10(L3)/LOG10(2))","v":32},null,"A.N.Other"]
[1,"Ladies Singles",null,null,null,null,null,null,null,null,"Number of teams",{"$f":"128-COUNTBLANK(C6:C133)","v":23}]
["Team","Draw",null,null,null,null,null,"Autodraw","Random",null,"Singles","Pairs","Triples","Fours"]
["Number","Number","Player 1","Player 2","Player 3","Player 4"]
[1,4,"Isla Lee",null,null,null,null,4,{"$f":"RAND()","v":0.35366073567401091},null,{"$f":"TRIM(C6)","v":"Isla Lee"},{"$f":"TRIM(C6)&CHAR(10)&(IF(LEN(D6)<1,ANOtext,TRIM(D6)))","v":"Isla Lee\nA.N.Other"},{"$f":"TRIM(C6)&CHAR(10)&(IF(LEN(D6)<1,ANOtext,TRIM(D6)))&CHAR(10)&(IF(LEN(E6)<1,ANOtext,TRIM(E6)))","v":"Isla Lee\nA.N.Other\nA.N.Other"},{"$f":"TRIM(C6)&CHAR(10)&(IF(LEN(D6)<1,ANOtext,TRIM(D6)))&CHAR(10)&(IF(LEN(E6)<1,ANOtext,TRIM(E6)))&CHAR(10)&(IF(LEN(F6)<1,ANOtext,TRIM(F6)))","v":"Isla Lee\nA.N.Other\nA.N.Other\nA.N.Other"}]
[2,9,"Charlotte Smith",null,null,null,null,9,0.2931422411911232,null,{"$f":"TRIM(C7)","v":"Charlotte Smith"},"Charlotte Smith\nA.N.Other","Charlotte Smith\nA.N.Other\nA.N.Other","Charlotte Smith\nA.N.Other\nA.N.Other\nA.N.Other"]
[3,6,"Cora Jones",null,null,null,null,6,0.91788106666044067,null,{"$f":"TRIM(C8)","v":"Cora Jones"},"Cora Jones\nA.N.Other","Cora Jones\nA.N.Other\nA.N.Other","Cora Jones\nA.N.Other\nA.N.Other\nA.N.Other"]
[4,11,"Penelope Taylor",null,null,null,null,11,0.66137087796345084,null,"Penelope Taylor","Penelope Taylor\nA.N.Other","Penelope Taylor\nA.N.Other\nA.N.Other","Penelope Taylor\nA.N.Other\nA.N.Other\nA.N.Other"]
[5,23,"Violet Williams",null,null,null,null,23,0.57059563367044241,null,"Violet Williams","Violet Williams\nA.N.Other","Violet Williams\nA.N.Other\nA.N.Other","Violet Williams\nA.N.Other\nA.N.Other\nA.N.Other"]
[6,5,"Hazel Brown",null,null,null,null,5,0.48810981611198867,null,"Hazel Brown","Hazel Brown\nA.N.Other","Hazel Brown\nA.N.Other\nA.N.Other","Hazel Brown\nA.N.Other\nA.N.Other\nA.N.Other"]
[7,3,"Eleanor Davies",null,null,null,null,3,0.17059807444020347,null,"Eleanor Davies","Eleanor Davies\nA.N.Other","Eleanor Davies\nA.N.Other\nA.N.Other","Eleanor Davies\nA.N.Other\nA.N.Other\nA.N.Other"]
[8,17,"Amelia Evans",null,null,null,null,17,0.46370974563109357,null,"Amelia Evans","Amelia Evans\nA.N.Other","Amelia Evans\nA.N.Other\nA.N.Other","Amelia Evans\nA.N.Other\nA.N.Other\nA.N.Other"]
[9,7,"Adeline Wilson",null,null,null,null,7,0.69217346325681783,null,"Adeline Wilson","Adeline Wilson\nA.N.Other","Adeline Wilson\nA.N.Other\nA.N.Other","Adeline Wilson\nA.N.Other\nA.N.Other\nA.N.Other"]
[10,20,"Claire Thomas",null,null,null,null,20,0.68932877014249072,null,"Claire Thomas","Claire Thomas\nA.N.Other","Claire Thomas\nA.N.Other\nA.N.Other","Claire Thomas\nA.N.Other\nA.N.Other\nA.N.Other"]
[11,15,"Adelaide Roberts",null,null,null,null,15,3.9698024474638771E-2,null,"Adelaide Roberts","Adelaide Roberts\nA.N.Other","Adelaide Roberts\nA.N.Other\nA.N.Other","Adelaide Roberts\nA.N.Other\nA.N.Other\nA.N.Other"]
[12,19,"Lucy Johnson",null,null,null,null,19,0.97456086093091754,null,"Lucy Johnson","Lucy Johnson\nA.N.Other","Lucy Johnson\nA.N.Other\nA.N.Other","Lucy Johnson\nA.N.Other\nA.N.Other\nA.N.Other"]
[13,2,"Genevieve Lewis",null,null,null,null,2,0.47739908026572042,null,"Genevieve Lewis","Genevieve Lewis\nA.N.Other","Genevieve Lewis\nA.N.Other\nA.N.Other","Genevieve Lewis\nA.N.Other\nA.N.Other\nA.N.Other"]
[14,21,"Lila Walker",null,null,null,null,21,0.51029173035875919,null,"Lila Walker","Lila Walker\nA.N.Other","Lila Walker\nA.N.Other\nA.N.Other","Lila Walker\nA.N.Other\nA.N.Other\nA.N.Other"]
[15,18,"Willa Robinson",null,null,"",null,18,0.10176138552842651,null,"Willa Robinson","Willa Robinson\nA.N.Other","Willa Robinson\nA.N.Other\nA.N.Other","Willa Robinson\nA.N.Other\nA.N.Other\nA.N.Other"]
[16,8,"Ivy Wood",null,null,"",null,8,0.61296164464029801,null,"Ivy Wood","Ivy Wood\nA.N.Other","Ivy Wood\nA.N.Other\nA.N.Other","Ivy Wood\nA.N.Other\nA.N.Other\nA.N.Other"]
[17,16,"Maisie Thompson",null,null,"",null,16,0.23816460252955995,null,"Maisie Thompson","Maisie Thompson\nA.N.Other","Maisie Thompson\nA.N.Other\nA.N.Other","Maisie Thompson\nA.N.Other\nA.N.Other\nA.N.Other"]
[18,10,"Alice White",null,null,"",null,10,0.56409657088038956,null,"Alice White","Alice White\nA.N.Other","Alice White\nA.N.Other\nA.N.Other","Alice White\nA.N.Other\nA.N.Other\nA.N.Other"]
[19,22,"Scarlett Watson",null,null,"",null,22,0.55808973688058949,null,"Scarlett Watson","Scarlett Watson\nA.N.Other","Scarlett Watson\nA.N.Other\nA.N.Other","Scarlett Watson\nA.N.Other\nA.N.Other\nA.N.Other"]
[20,14,"Evangeline Jackson",null,null,"",null,14,0.31504878648450974,null,"Evangeline Jackson","Evangeline Jackson\nA.N.Other","Evangeline Jackson\nA.N.Other\nA.N.Other","Evangeline Jackson\nA.N.Other\nA.N.Other\nA.N.Other"]
[21,1,"Ellie Wright",null,null,"",null,1,0.28439167788248809,null,"Ellie Wright","Ellie Wright\nA.N.Other","Ellie Wright\nA.N.Other\nA.N.Other","Ellie Wright\nA.N.Other\nA.N.Other\nA.N.Other"]
[22,13,"Cordelia Green",null,null,"",null,13,0.52061609050546021,null,"Cordelia Green","Cordelia Green\nA.N.Other","Cordelia Green\nA.N.Other\nA.N.Other","Cordelia Green\nA.N.Other\nA.N.Other\nA.N.Other"]
[23,12,"Olivia Harris",null,null,"",null,12,4.1138103180509478E-2,null,"Olivia Harris","Olivia Harris\nA.N.Other","Olivia Harris\nA.N.Other\nA.N.Other","Olivia Harris\nA.N.Other\nA.N.Other\nA.N.Other"]
[24,null,null,null,null,"",null,1,{"$f":"RAND()","v":0.14680796180304756},null,"","\nA.N.Other","\nA.N.Other\nA.N.Other","\nA.N.Other\nA.N.Other\nA.N.Other"]
[25,null,null,null,null,"",null,26,7.7759649487666338E-2,null,"","\nA.N.Other","\nA.N.Other\nA.N.Other","\nA.N.Other\nA.N.Other\nA.N.Other"]
[26,null,null,null,null,"",null,9,0.49559808744421197,null,"","\nA.N.Other","\nA.N.Other\nA.N.Other","\nA.N.Other\nA.N.Other\nA.N.Other"]
[27,null,null,null,null,"",null,3,0.52738384371287472,null,"","\nA.N.Other","\nA.N.Other\nA.N.Other","\nA.N.Other\nA.N.Other\nA.N.Other"]
[28,null,null,null,null,"",null,8,0.23700431075145023,null,"","\nA.N.Other","\nA.N.Other\nA.N.Other","\nA.N.Other\nA.N.Other\nA.N.Other"]
[29,null,null,null,null,"",null,18,0.5450943865866632,null,"","\nA.N.Other","\nA.N.Other\nA.N.Other","\nA.N.Other\nA.N.Other\nA.N.Other"]
[30,null,null,null,null,"",null,24,0.64377956459297614,null,"","\nA.N.Other","\nA.N.Other\nA.N.Other","\nA.N.Other\nA.N.Other\nA.N.Other"]
[31,null,null,"","","",null,15,0.62129107034454756,null,"","\nA.N.Other","\nA.N.Other\nA.N.Other","\nA.N.Other\nA.N.Other\nA.N.Other"]
[32,null,null,"","","",null,17,2.7547966592672668E-2,null,"","\nA.N.Other","\nA.N.Other\nA.N.Other","\nA.N.Other\nA.N.Other\nA.N.Other"]
[33,null,null,"","","",null,4,0.35078483039004504,null,"",{"$f":"TRIM(C38)&CHAR(10)&(IF(LEN(D38)<1,ANOtext,TRIM(D38)))","v":"\nA.N.Other"},{"$f":"TRIM(C38)&CHAR(10)&(IF(LEN(D38)<1,ANOtext,TRIM(D38)))&CHAR(10)&(IF(LEN(E38)<1,ANOtext,TRIM(E38)))","v":"\nA.N.Other\nA.N.Other"},{"$f":"TRIM(C38)&CHAR(10)&(IF(LEN(D38)<1,ANOtext,TRIM(D38)))&CHAR(10)&(IF(LEN(E38)<1,ANOtext,TRIM(E38)))&CHAR(10)&(IF(LEN(F38)<1,ANOtext,TRIM(F38)))","v":"\nA.N.Other\nA.N.Other\nA.N.Other"}]
[34,null,null,"","","",null,10,0.77162283657719499,null,"","\nA.N.Other","\nA.N.Other\nA.N.Other","\nA.N.Other\nA.N.Other\nA.N.Other"]
[35,null,null,"","","",null,25,0.1492488230575425,null,"","\nA.N.Other","\nA.N.Other\nA.N.Other","\nA.N.Other\nA.N.Other\nA.N.Other"]
[36,null,null,"","","",null,11,0.95815731632318724,null,"","\nA.N.Other","\nA.N.Other\nA.N.Other","\nA.N.Other\nA.N.Other\nA.N.Other"]
[37,null,null,"","","",null,31,0.45864995847614032,null,"","\nA.N.Other","\nA.N.Other\nA.N.Other","\nA.N.Other\nA.N.Other\nA.N.Other"]
[38,null,null,"","","",null,16,0.78301969085667911,null,"","\nA.N.Other","\nA.N.Other\nA.N.Other","\nA.N.Other\nA.N.Other\nA.N.Other"]
[39,null,null,"","","",null,35,0.5919418081118264,null,"","\nA.N.Other","\nA.N.Other\nA.N.Other","\nA.N.Other\nA.N.Other\nA.N.Other"]
[40,null,null,"","","",null,33,0.49641247813946632,null,"","\nA.N.Other","\nA.N.Other\nA.N.Other","\nA.N.Other\nA.N.Other\nA.N.Other"]
[41,null,null,"","","",null,12,0.94088974626118616,null,"","\nA.N.Other","\nA.N.Other\nA.N.Other","\nA.N.Other\nA.N.Other\nA.N.Other"]
[42,null,null,"","","",null,9,0.21138215138342831,null,"","\nA.N.Other","\nA.N.Other\nA.N.Other","\nA.N.Other\nA.N.Other\nA.N.Other"]
[43,null,null,"","","",null,107,{"$f":"RAND()","v":0.83097295818723216},null,"","\nA.N.Other","\nA.N.Other\nA.N.Other","\nA.N.Other\nA.N.Other\nA.N.Other"]
[44,null,null,"","","",null,27,0.8523801269572836,null,"","\nA.N.Other","\nA.N.Other\nA.N.Other","\nA.N.Other\nA.N.Other\nA.N.Other"]
[45,null,null,"","","",null,49,0.74338719654428342,null,"","\nA.N.Other","\nA.N.Other\nA.N.Other","\nA.N.Other\nA.N.Other\nA.N.Other"]
[46,null,null,"","","",null,118,0.64192304326455341,null,"","\nA.N.Other","\nA.N.Other\nA.N.Other","\nA.N.Other\nA.N.Other\nA.N.Other"]
[47,null,null,"","","",null,64,0.97136192282597478,null,"","\nA.N.Other","\nA.N.Other\nA.N.Other","\nA.N.Other\nA.N.Other\nA.N.Other"]
[48,null,null,"","","",null,29,0.4260354368019057,null,"","\nA.N.Other","\nA.N.Other\nA.N.Other","\nA.N.Other\nA.N.Other\nA.N.Other"]
[49,null,null,"","","",null,42,0.28294569645628376,null,"","\nA.N.Other","\nA.N.Other\nA.N.Other","\nA.N.Other\nA.N.Other\nA.N.Other"]
[50,null,null,"","","",null,63,0.7877638437891662,null,"","\nA.N.Other","\nA.N.Other\nA.N.Other","\nA.N.Other\nA.N.Other\nA.N.Other"]
[51,null,null,"","","",null,16,0.1489260055449082,null,"","\nA.N.Other","\nA.N.Other\nA.N.Other","\nA.N.Other\nA.N.Other\nA.N.Other"]
[52,null,null,"","","",null,37,4.8078116623264999E-2,null,"","\nA.N.Other","\nA.N.Other\nA.N.Other","\nA.N.Other\nA.N.Other\nA.N.Other"]
[53,null,"","","","",null,105,0.42301943077543736,null,"","\nA.N.Other","\nA.N.Other\nA.N.Other","\nA.N.Other\nA.N.Other\nA.N.Other"]
[54,null,"","","","",null,126,0.6171885441280015,null,"","\nA.N.Other","\nA.N.Other\nA.N.Other","\nA.N.Other\nA.N.Other\nA.N.Other"]
[55,null,"","","","",null,53,0.78378923639500364,null,"","\nA.N.Other","\nA.N.Other\nA.N.Other","\nA.N.Other\nA.N.Other\nA.N.Other"]
[56,null,"","","","",null,1,9.3505652525932681E-2,null,"","\nA.N.Other","\nA.N.Other\nA.N.Other","\nA.N.Other\nA.N.Other\nA.N.Other"]
[57,null,"","","","",null,38,0.72846381831566898,null,"","\nA.N.Other","\nA.N.Other\nA.N.Other","\nA.N.Other\nA.N.Other\nA.N.Other"]
[58,null,"","","","",null,112,0.66967385712184613,null,"","\nA.N.Other","\nA.N.Other\nA.N.Other","\nA.N.Other\nA.N.Other\nA.N.Other"]
[59,null,"","","","",null,77,0.14347393552973531,null,"","\nA.N.Other","\nA.N.Other\nA.N.Other","\nA.N.Other\nA.N.Other\nA.N.Other"]
[60,null,"","","","",null,116,0.29604276975483435,null,"","\nA.N.Other","\nA.N.Other\nA.N.Other","\nA.N.Other\nA.N.Other\nA.N.Other"]
[61,null,"","","","",null,6,0.73799475016446003,null,"","\nA.N.Other","\nA.N.Other\nA.N.Other","\nA.N.Other\nA.N.Other\nA.N.Other"]
[62,null,"","","","",null,51,0.31828944104969947,null,"","\nA.N.Other","\nA.N.Other\nA.N.Other","\nA.N.Other\nA.N.Other\nA.N.Other"]
[63,null,"","","","",null,50,0.91930509391391113,null,"","\nA.N.Other","\nA.N.Other\nA.N.Other","\nA.N.Other\nA.N.Other\nA.N.Other"]
[64,null,"","","","",null,125,0.48801951900013429,null,"","\nA.N.Other","\nA.N.Other\nA.N.Other","\nA.N.Other\nA.N.Other\nA.N.Other"]
[65,null,"","","","",null,119,{"$f":"RAND()","v":0.83105467838714664},null,"",{"$f":"TRIM(C70)&CHAR(10)&(IF(LEN(D70)<1,ANOtext,TRIM(D70)))","v":"\nA.N.Other"},{"$f":"TRIM(C70)&CHAR(10)&(IF(LEN(D70)<1,ANOtext,TRIM(D70)))&CHAR(10)&(IF(LEN(E70)<1,ANOtext,TRIM(E70)))","v":"\nA.N.Other\nA.N.Other"},{"$f":"TRIM(C70)&CHAR(10)&(IF(LEN(D70)<1,ANOtext,TRIM(D70)))&CHAR(10)&(IF(LEN(E70)<1,ANOtext,TRIM(E70)))&CHAR(10)&(IF(LEN(F70)<1,ANOtext,TRIM(F70)))","v":"\nA.N.Other\nA.N.Other\nA.N.Other"}]
[66,null,"","","","",null,68,0.92832916265767318,null,"","\nA.N.Other","\nA.N.Other\nA.N.Other","\nA.N.Other\nA.N.Other\nA.N.Other"]
[67,null,"","","","",null,86,0.99779657607382921,null,{"$f":"TRIM(C72)","v":""},"\nA.N.Other","\nA.N.Other\nA.N.Other","\nA.N.Other\nA.N.Other\nA.N.Other"]
[68,null,"","","","",null,72,0.95644124787351315,null,"","\nA.N.Other","\nA.N.Other\nA.N.Other","\nA.N.Other\nA.N.Other\nA.N.Other"]
[69,null,"","","","",null,18,0.97526752539300487,null,"","\nA.N.Other","\nA.N.Other\nA.N.Other","\nA.N.Other\nA.N.Other\nA.N.Other"]
[70,null,"","","","",null,8,0.49466914452670419,null,"","\nA.N.Other","\nA.N.Other\nA.N.Other","\nA.N.Other\nA.N.Other\nA.N.Other"]
[71,null,"","","","",null,114,0.54914139623829406,null,"","\nA.N.Other","\nA.N.Other\nA.N.Other","\nA.N.Other\nA.N.Other\nA.N.Other"]
[72,null,"","","","",null,62,0.52049256512043329,null,"","\nA.N.Other","\nA.N.Other\nA.N.Other","\nA.N.Other\nA.N.Other\nA.N.Other"]
[73,null,"","","","",null,109,0.47613432625610352,null,"","\nA.N.Other","\nA.N.Other\nA.N.Other","\nA.N.Other\nA.N.Other\nA.N.Other"]
[74,null,"","","","",null,111,0.74661366334559476,null,"","\nA.N.Other","\nA.N.Other\nA.N.Other","\nA.N.Other\nA.N.Other\nA.N.Other"]
[75,null,"","","","",null,74,7.7556553039888398E-2,null,"","\nA.N.Other","\nA.N.Other\nA.N.Other","\nA.N.Other\nA.N.Other\nA.N.Other"]
[76,null,"","","","",null,67,0.2424083894905078,null,"","\nA.N.Other","\nA.N.Other\nA.N.Other","\nA.N.Other\nA.N.Other\nA.N.Other"]
[77,null,"","","","",null,99,0.61353593191816902,null,"","\nA.N.Other","\nA.N.Other\nA.N.Other","\nA.N.Other\nA.N.Other\nA.N.Other"]
[78,null,"","","","",null,4,2.7971547564482724E-2,null,"","\nA.N.Other","\nA.N.Other\nA.N.Other","\nA.N.Other\nA.N.Other\nA.N.Other"]
[79,null,"","","","",null,66,0.83147340020954974,null,"","\nA.N.Other","\nA.N.Other\nA.N.Other","\nA.N.Other\nA.N.Other\nA.N.Other"]
[80,null,"","","","",null,33,0.21899396587342912,null,"","\nA.N.Other","\nA.N.Other\nA.N.Other","\nA.N.Other\nA.N.Other\nA.N.Other"]
[81,null,"","","","",null,20,0.98124731413759869,null,"","\nA.N.Other","\nA.N.Other\nA.N.Other","\nA.N.Other\nA.N.Other\nA.N.Other"]
[82,null,"","","","",null,21,0.5210091931677413,null,"","\nA.N.Other","\nA.N.Other\nA.N.Other","\nA.N.Other\nA.N.Other\nA.N.Other"]
[83,null,"","","","",null,123,0.47409035993749915,null,"","\nA.N.Other","\nA.N.Other\nA.N.Other","\nA.N.Other\nA.N.Other\nA.N.Other"]
[84,null,"","","","",null,60,0.45034763100879682,null,"","\nA.N.Other","\nA.N.Other\nA.N.Other","\nA.N.Other\nA.N.Other\nA.N.Other"]
[85,null,"","","","",null,26,0.41864998628154326,null,"","\nA.N.Other","\nA.N.Other\nA.N.Other","\nA.N.Other\nA.N.Other\nA.N.Other"]
[86,null,"","","","",null,10,0.64916315790767865,null,"","\nA.N.Other","\nA.N.Other\nA.N.Other","\nA.N.Other\nA.N.Other\nA.N.Other"]
[87,null,"","","","",null,91,0.71214609726898936,null,"","\nA.N.Other","\nA.N.Other\nA.N.Other","\nA.N.Other\nA.N.Other\nA.N.Other"]
[88,null,"","","","",null,82,0.88592431451135856,null,"","\nA.N.Other","\nA.N.Other\nA.N.Other","\nA.N.Other\nA.N.Other\nA.N.Other"]
[89,null,"","","","",null,102,6.9546108155993491E-2,null,"","\nA.N.Other","\nA.N.Other\nA.N.Other","\nA.N.Other\nA.N.Other\nA.N.Other"]
[90,null,"","","","",null,34,0.1319914174080431,null,"","\nA.N.Other","\nA.N.Other\nA.N.Other","\nA.N.Other\nA.N.Other\nA.N.Other"]
[91,null,"","","","",null,43,0.21123841451824532,null,"","\nA.N.Other","\nA.N.Other\nA.N.Other","\nA.N.Other\nA.N.Other\nA.N.Other"]
[92,null,"","","","",null,78,0.23750942951953424,null,"","\nA.N.Other","\nA.N.Other\nA.N.Other","\nA.N.Other\nA.N.Other\nA.N.Other"]
[93,null,"","","","",null,65,0.29293869577298171,null,"","\nA.N.Other","\nA.N.Other\nA.N.Other","\nA.N.Other\nA.N.Other\nA.N.Other"]
[94,null,"","","","",null,2,0.59540119735652342,null,"","\nA.N.Other","\nA.N.Other\nA.N.Other","\nA.N.Other\nA.N.Other\nA.N.Other"]
[95,null,"","","","",null,45,0.27647035793432617,null,"","\nA.N.Other","\nA.N.Other\nA.N.Other","\nA.N.Other\nA.N.Other\nA.N.Other"]
[96,null,"","","","",null,124,0.73202912847029911,null,"","\nA.N.Other","\nA.N.Other\nA.N.Other","\nA.N.Other\nA.N.Other\nA.N.Other"]
[97,null,"","","","",null,22,{"$f":"RAND()","v":0.46559074803763323},null,"",{"$f":"TRIM(C102)&CHAR(10)&(IF(LEN(D102)<1,ANOtext,TRIM(D102)))","v":"\nA.N.Other"},{"$f":"TRIM(C102)&CHAR(10)&(IF(LEN(D102)<1,ANOtext,TRIM(D102)))&CHAR(10)&(IF(LEN(E102)<1,ANOtext,TRIM(E102)))","v":"\nA.N.Other\nA.N.Other"},{"$f":"TRIM(C102)&CHAR(10)&(IF(LEN(D102)<1,ANOtext,TRIM(D102)))&CHAR(10)&(IF(LEN(E102)<1,ANOtext,TRIM(E102)))&CHAR(10)&(IF(LEN(F102)<1,ANOtext,TRIM(F102)))","v":"\nA.N.Other\nA.N.Other\nA.N.Other"}]
[98,null,"","","","",null,95,0.76764037481348912,null,"","\nA.N.Other","\nA.N.Other\nA.N.Other","\nA.N.Other\nA.N.Other\nA.N.Other"]
[99,null,"","","","",null,122,0.96807492522618144,null,"","\nA.N.Other","\nA.N.Other\nA.N.Other","\nA.N.Other\nA.N.Other\nA.N.Other"]
[100,null,"","","","",null,106,0.47427063456902363,null,"","\nA.N.Other","\nA.N.Other\nA.N.Other","\nA.N.Other\nA.N.Other\nA.N.Other"]
[101,null,"","","","",null,13,0.16850562929307378,null,"","\nA.N.Other","\nA.N.Other\nA.N.Other","\nA.N.Other\nA.N.Other\nA.N.Other"]
[102,null,"","","","",null,73,0.38540371693561637,null,"","\nA.N.Other","\nA.N.Other\nA.N.Other","\nA.N.Other\nA.N.Other\nA.N.Other"]
[103,null,"","","","",null,19,0.20997592791787945,null,"","\nA.N.Other","\nA.N.Other\nA.N.Other","\nA.N.Other\nA.N.Other\nA.N.Other"]
[104,null,"","","","",null,59,0.45516436006313543,null,"","\nA.N.Other","\nA.N.Other\nA.N.Other","\nA.N.Other\nA.N.Other\nA.N.Other"]
[105,null,"","","","",null,5,0.96236584044970808,null,"","\nA.N.Other","\nA.N.Other\nA.N.Other","\nA.N.Other\nA.N.Other\nA.N.Other"]
[106,null,"","","","",null,9,0.31227741517725416,null,"","\nA.N.Other","\nA.N.Other\nA.N.Other","\nA.N.Other\nA.N.Other\nA.N.Other"]
[107,null,"","","","",null,39,0.29079931217845756,null,"","\nA.N.Other","\nA.N.Other\nA.N.Other","\nA.N.Other\nA.N.Other\nA.N.Other"]
[108,null,"","","","",null,90,0.56541804250223604,null,"","\nA.N.Other","\nA.N.Other\nA.N.Other","\nA.N.Other\nA.N.Other\nA.N.Other"]
[109,null,"","","","",null,11,0.48171658630359881,null,"","\nA.N.Other","\nA.N.Other\nA.N.Other","\nA.N.Other\nA.N.Other\nA.N.Other"]
[110,null,"","","","",null,17,0.3836759217717961,null,"","\nA.N.Other","\nA.N.Other\nA.N.Other","\nA.N.Other\nA.N.Other\nA.N.Other"]
[111,null,"","","","",null,103,0.3282938336171336,null,"","\nA.N.Other","\nA.N.Other\nA.N.Other","\nA.N.Other\nA.N.Other\nA.N.Other"]
[112,null,"","","","",null,120,0.14111595319527714,null,"","\nA.N.Other","\nA.N.Other\nA.N.Other","\nA.N.Other\nA.N.Other\nA.N.Other"]
[113,null,"","","","",null,75,0.35067570742114351,null,"","\nA.N.Other","\nA.N.Other\nA.N.Other","\nA.N.Other\nA.N.Other\nA.N.Other"]
[114,null,"","","","",null,70,0.83015596720651419,null,"","\nA.N.Other","\nA.N.Other\nA.N.Other","\nA.N.Other\nA.N.Other\nA.N.Other"]
[115,null,"","","","",null,115,0.45591634730829045,null,"","\nA.N.Other","\nA.N.Other\nA.N.Other","\nA.N.Other\nA.N.Other\nA.N.Other"]
[116,null,"","","","",null,121,0.19475469580539173,null,"","\nA.N.Other","\nA.N.Other\nA.N.Other","\nA.N.Other\nA.N.Other\nA.N.Other"]
[117,null,"","","","",null,41,0.80701029175397021,null,"","\nA.N.Other","\nA.N.Other\nA.N.Other","\nA.N.Other\nA.N.Other\nA.N.Other"]
[118,null,"","","","",null,128,0.6468067664451389,null,"","\nA.N.Other","\nA.N.Other\nA.N.Other","\nA.N.Other\nA.N.Other\nA.N.Other"]
[119,null,"","","","",null,25,0.7388976763128503,null,"","\nA.N.Other","\nA.N.Other\nA.N.Other","\nA.N.Other\nA.N.Other\nA.N.Other"]
[120,null,"","","","",null,92,0.55151828995364138,null,"","\nA.N.Other","\nA.N.Other\nA.N.Other","\nA.N.Other\nA.N.Other\nA.N.Other"]
[121,null,"","","","",null,104,0.7640996450069022,null,"","\nA.N.Other","\nA.N.Other\nA.N.Other","\nA.N.Other\nA.N.Other\nA.N.Other"]
[122,null,"","","","",null,79,0.68112651269141433,null,"","\nA.N.Other","\nA.N.Other\nA.N.Other","\nA.N.Other\nA.N.Other\nA.N.Other"]
[123,null,"","","","",null,40,0.89285389404561422,null,"","\nA.N.Other","\nA.N.Other\nA.N.Other","\nA.N.Other\nA.N.Other\nA.N.Other"]
[124,null,"","","","",null,117,0.25040871092662698,null,"","\nA.N.Other","\nA.N.Other\nA.N.Other","\nA.N.Other\nA.N.Other\nA.N.Other"]
[125,null,"","","","",null,97,0.17486371228331521,null,"","\nA.N.Other","\nA.N.Other\nA.N.Other","\nA.N.Other\nA.N.Other\nA.N.Other"]
[126,null,"","","","",null,96,3.0227322793996425E-3,null,"","\nA.N.Other","\nA.N.Other\nA.N.Other","\nA.N.Other\nA.N.Other\nA.N.Other"]
[127,null,"","","","",null,7,0.53580728143810263,null,"","\nA.N.Other","\nA.N.Other\nA.N.Other","\nA.N.Other\nA.N.Other\nA.N.Other"]
[128,null,"","","","",null,113,0.12381993901900945,null,"","\nA.N.Other","\nA.N.Other\nA.N.Other","\nA.N.Other\nA.N.Other\nA.N.Other"]